E:git\BungeeCord>mvn install
[INFO] Scanning for projects...
[INFO] ------------------------------------------------------------------------
[INFO] Reactor Build Order:
[INFO]
[INFO] BungeeCord-Parent [pom]
[INFO] BungeeCord-Chat [jar]
[INFO] BungeeCord-Config [jar]
[INFO] BungeeCord-Event [jar]
[INFO] BungeeCord-Protocol [jar]
[INFO] BungeeCord-API [jar]
[INFO] BungeeCord-Log [jar]
[INFO] BungeeCord-Native [jar]
[INFO] BungeeCord-Query [jar]
[INFO] BungeeCord-Proxy [jar]
[INFO] BungeeCord-Bootstrap [jar]
[INFO] BungeeCord Modules [pom]
[INFO] cmd_alert [jar]
[INFO] cmd_find [jar]
[INFO] cmd_list [jar]
[INFO] cmd_send [jar]
[INFO] cmd_server [jar]
[INFO] reconnect_yaml [jar]
[INFO]
[INFO] ---------------------< net.md-5:bungeecord-parent >---------------------
[INFO] Building BungeeCord-Parent 1.13-SNAPSHOT [1/18]
[INFO] --------------------------------[ pom ]---------------------------------
[INFO]
[INFO] --- scriptus:0.3.1:describe (default) @ bungeecord-parent ---
[INFO] Set property "describe" to "git:BungeeCord-Parent:1.13-SNAPSHOT:ba07397:u
nknown"
[INFO]
[INFO] --- animal-sniffer-maven-plugin:1.16:check (default) @ bungeecord-parent
---
[INFO] Checking unresolved references to org.codehaus.mojo.signature:java17:1.0
[INFO]
[INFO] --- maven-install-plugin:2.4:install (default-install) @ bungeecord-paren
t ---
[INFO] Installing E:\Users\ПК\git\ACord\pom.xml to E:\Users\ПК\.m2\repository\ne
t\md-5\bungeecord-parent\1.13-SNAPSHOT\bungeecord-parent-1.13-SNAPSHOT.pom
[INFO]
[INFO] ----------------------< net.md-5:bungeecord-chat >----------------------
[INFO] Building BungeeCord-Chat 1.13-SNAPSHOT [2/18]
[INFO] --------------------------------[ jar ]---------------------------------
[INFO]
[INFO] --- scriptus:0.3.1:describe (default) @ bungeecord-chat ---
[INFO] Set property "describe" to "git:BungeeCord-Chat:1.13-SNAPSHOT:ba07397:unk
nown"
[INFO]
[INFO] --- maven-resources-plugin:2.6:resources (default-resources) @ bungeecord
-chat ---
[INFO] Using 'UTF-8' encoding to copy filtered resources.
[INFO] Copying 1 resource
[INFO]
[INFO] --- maven-compiler-plugin:3.1:compile (default-compile) @ bungeecord-chat
---
[INFO] Changes detected - recompiling the module!
[INFO] Compiling 20 source files to E:\Users\ПК\git\ACord\chat\target\classes
[INFO] -------------------------------------------------------------
[ERROR] COMPILATION ERROR :
[INFO] -------------------------------------------------------------
[ERROR] No compiler is provided in this environment. Perhaps you are running on
a JRE rather than a JDK?
[INFO] 1 error
[INFO] -------------------------------------------------------------
[INFO] ------------------------------------------------------------------------
[INFO] Reactor Summary:
[INFO]
[INFO] BungeeCord-Parent 1.13-SNAPSHOT .................... SUCCESS [ 3.361 s]
[INFO] BungeeCord-Chat .................................... FAILURE [ 0.930 s]
[INFO] BungeeCord-Config .................................. SKIPPED
[INFO] BungeeCord-Event ................................... SKIPPED
[INFO] BungeeCord-Protocol ................................ SKIPPED
[INFO] BungeeCord-API ..................................... SKIPPED
[INFO] BungeeCord-Log ..................................... SKIPPED
[INFO] BungeeCord-Native .................................. SKIPPED
[INFO] BungeeCord-Query ................................... SKIPPED
[INFO] BungeeCord-Proxy ................................... SKIPPED
[INFO] BungeeCord-Bootstrap ............................... SKIPPED
[INFO] BungeeCord Modules ................................. SKIPPED
[INFO] cmd_alert .......................................... SKIPPED
[INFO] cmd_find ........................................... SKIPPED
[INFO] cmd_list ........................................... SKIPPED
[INFO] cmd_send ........................................... SKIPPED
[INFO] cmd_server ......................................... SKIPPED
[INFO] reconnect_yaml 1.13-SNAPSHOT ....................... SKIPPED
[INFO] ------------------------------------------------------------------------
[INFO] BUILD FAILURE
[INFO] ------------------------------------------------------------------------
[INFO] Total time: 5.244 s
[INFO] Finished at: 2018-09-04T16:42:20+03:00
[INFO] ------------------------------------------------------------------------
[ERROR] Failed to execute goal org.apache.maven.plugins:maven-compiler-plugin:3.
1:compile (default-compile) on project bungeecord-chat: Compilation failure
[ERROR] No compiler is provided in this environment. Perhaps you are running on
a JRE rather than a JDK?
[ERROR]
[ERROR] -> [Help 1]
[ERROR]
[ERROR] To see the full stack trace of the errors, re-run Maven with the -e swit
ch.
[ERROR] Re-run Maven using the -X switch to enable full debug logging.
[ERROR]
[ERROR] For more information about the errors and possible solutions, please rea
d the following articles:
[ERROR] [Help 1] http://cwiki.apache.org/confluence/display/MAVEN/MojoFailureExc
eption
[ERROR]
[ERROR] After correcting the problems, you can resume the build with the command
[ERROR] mvn <goals> -rf :bungeecord-chat