- Баллы
- 76
- Имя в Minecraft
- _MasterCapeXD_
Добавил в Maven проект зависимость Redis. При обычной сборке на сервере выскакивает ошибка NoClassDefFoundError на Jedis.class, а когда добавляю плагин, то получается Build Failure
Помогите, пожалуйста
pom.xml:
Помогите, пожалуйста
pom.xml:
Код:
<project xmlns="http://maven.apache.org/POM/4.0.0" xmlns:xsi="http://www.w3.org/2001/XMLSchema-instance" xsi:schemaLocation="http://maven.apache.org/POM/4.0.0 http://maven.apache.org/xsd/maven-4.0.0.xsd">
<modelVersion>4.0.0</modelVersion>
<groupId>me.mastercapexd.staff</groupId>
<artifactId>Staff</artifactId>
<version>0.0.1-SNAPSHOT</version>
<build>
<plugins>
<plugin>
<groupId>org.apache.maven.plugins</groupId>
<artifactId>maven-shade-plugin</artifactId>
<version>2.1</version>
<executions>
<execution>
<phase>package</phase>
<goals>
<goal>shade</goal>
</goals>
<configuration>
<relocations>
<relocation>
<pattern>redis.clients.jedis</pattern>
<shadedPattern>your.package.here.shaded.redis.clients.jedis</shadedPattern>
<pattern>org.apache.commons</pattern>
<shadedPattern>your.package.here.shaded.org.apache.commons</shadedPattern>
</relocation>
</relocations>
</configuration>
</execution>
</executions>
</plugin>
</plugins>
</build>
<repositories>
<repository>
<id>spigot-repo</id>
<url>https://hub.spigotmc.org/nexus/content/repositories/snapshots/</url>
</repository>
<repository>
<id>vault-repo</id>
<url>http://nexus.hc.to/content/repositories/pub_releases</url>
</repository>
</repositories>
<dependencies>
<!--Spigot API-->
<dependency>
<groupId>org.spigotmc</groupId>
<artifactId>spigot-api</artifactId>
<version>1.8-R0.1-SNAPSHOT</version>
<scope>provided</scope>
</dependency>
<!--Bukkit API-->
<dependency>
<groupId>org.bukkit</groupId>
<artifactId>bukkit</artifactId>
<version>1.8-R0.1-SNAPSHOT</version>
<scope>provided</scope>
</dependency>
<!--Vault API-->
<dependency>
<groupId>net.milkbowl.vault</groupId>
<artifactId>VaultAPI</artifactId>
<version>1.7</version>
<scope>provided</scope>
</dependency>
<dependency>
<groupId>redis.clients</groupId>
<artifactId>jedis</artifactId>
<version>2.4.2</version>
</dependency>
</dependencies>
</project>
Код:
[INFO] Scanning for projects...
[INFO]
[INFO] ------------------------------------------------------------------------
[INFO] Building Staff 0.0.1-SNAPSHOT
[INFO] ------------------------------------------------------------------------
[INFO]
[INFO] --- maven-resources-plugin:2.6:resources (default-resources) @ Staff ---
[WARNING] Using platform encoding (Cp1251 actually) to copy filtered resources, i.e. build is platform dependent!
[INFO] Copying 3 resources
[INFO]
[INFO] --- maven-compiler-plugin:3.1:compile (default-compile) @ Staff ---
[INFO] Nothing to compile - all classes are up to date
[INFO]
[INFO] --- maven-resources-plugin:2.6:testResources (default-testResources) @ Staff ---
[WARNING] Using platform encoding (Cp1251 actually) to copy filtered resources, i.e. build is platform dependent!
[INFO] Copying 0 resource
[INFO]
[INFO] --- maven-compiler-plugin:3.1:testCompile (default-testCompile) @ Staff ---
[INFO] Nothing to compile - all classes are up to date
[INFO]
[INFO] --- maven-surefire-plugin:2.12.4:test (default-test) @ Staff ---
[INFO]
[INFO] --- maven-jar-plugin:2.4:jar (default-jar) @ Staff ---
[INFO] Building jar: D:\Other\Data\development\Java\my projects\Spigot\Staff\target\Staff-0.0.1-SNAPSHOT.jar
[INFO]
[INFO] --- maven-shade-plugin:2.1:shade (default) @ Staff ---
[INFO] Including redis.clients:jedis:jar:2.4.2 in the shaded jar.
[INFO] Including org.apache.commons:commons-pool2:jar:2.0 in the shaded jar.
[INFO] ------------------------------------------------------------------------
[INFO] BUILD FAILURE
[INFO] ------------------------------------------------------------------------
[INFO] Total time: 4.357 s
[INFO] Finished at: 2018-11-07T19:20:08+02:00
[INFO] Final Memory: 12M/212M
[INFO] ------------------------------------------------------------------------
[ERROR] Failed to execute goal org.apache.maven.plugins:maven-shade-plugin:2.1:shade (default) on project Staff: Error creating shaded jar: 13932 -> [Help 1]
[ERROR]
[ERROR] To see the full stack trace of the errors, re-run Maven with the -e switch.
[ERROR] Re-run Maven using the -X switch to enable full debug logging.
[ERROR]
[ERROR] For more information about the errors and possible solutions, please read the following articles:
[ERROR] [Help 1] http://cwiki.apache.org/confluence/display/MAVEN/MojoExecutionException